{"text_format":"1","workbook":"xlsx","n_sheets":10,"sheets":["gl. til nyt niveau","reguleringsprocenter","Lønark","Forside","Omregner","Omregningstabel ","Tillæg_trin","Tillæg_kr","Samlet_omk","Tid op_ned"],"not_rendered":{"charts":0,"images":9,"macros":1,"external_links":0,"defined_names":75,"comments":1,"pivot_tables":0},"unopened":[],"bounds":{"document_bytes":16777216,"sheet_cells":100000,"rows_first":2000,"rows_last":500,"rows_between":2000,"halvings":0,"cell_chars":16384,"cell_head_chars":4096},"cells_cut":0,"cells_raw":0,"read":"whole","date_system":"1900"}

{"sheet":"gl. til nyt niveau","index":0,"n_rows":395,"n_cols":6,"rows_kept":395,"cut":false,"hidden":true,"merged":[]}
[null,1.3980790000000001]
[null,null,null,"Nyt grundbeløb","Nyt grundbeløb"]
["Grundbeløb pr. 1/10-1984","I alt pr. 1. april 1999 inkl. %regulering",null,"pr. 31/3-2000","pr. 31/3-2000"]
[null,null,null,"ekskl. afrunding","inkl. afrunding"]
[null,null,null,null,null,"beløb"]
[null,"pr. gang/år","pr. måned",null,null,"+/-"]
[1.63,{"$f":"IF(A7<1000,$B$1*A7,ROUND($B$1*A7,0))","v":2.2788687699999999},null,{"$f":"B7","v":2.2788687699999999},{"$f":"IF(D7<1000,D7,ROUND(D7,-2))","v":2.2788687699999999}]
[5,6.9903950000000004,null,{"$f":"B8","v":6.9903950000000004},6.9903950000000004]
[5.8,8.1088582000000002,null,8.1088582000000002,8.1088582000000002]
[9,12.582711,null,12.582711,12.582711]
[10.5,14.6798295,null,14.6798295,14.6798295]
[12.22,17.084525380000002,null,17.084525380000002,17.084525380000002]
[12.65,17.68569935,null,17.68569935,17.68569935]
[13.39,18.720277810000002,null,18.720277810000002,18.720277810000002]
[13.75,19.22358625,null,19.22358625,19.22358625]
{"$rows_left_out":381}
{"sheet":"reguleringsprocenter","index":1,"n_rows":30,"n_cols":4,"rows_kept":30,"cut":false,"hidden":true,"merged":[]}
[]
[null,"Reguleringsprocenter",null,"pensionsudbygning"]
[null,"Valgt:",{"$f":"VLOOKUP(Forside!K11,reguleringsprocenter!B4:D15,2,TRUE)","v":1.4983040000000001}]
[null,"2019-04-01",1.3772530000000001,1]
[null,"2019-10-01",1.3908609999999999,1]
[null,"2020-01-01",1.4124110000000001,1]
[null,"2020-04-01",1.4177979999999999,1]
[null,"2020-10-01",1.4285110000000001,1]
[null,"2021-04-01",1.442796,1]
[null,"2021-10-01",1.456933,1]
[null,"2022-04-01",1.456933,1]
[null,"2022-10-01",1.4940180000000001,1]
[null,"2023-04-01",1.4983040000000001,1]
[null,"2023-10-01",1.5169710000000001,1]
[]
{"$rows_left_out":16}
{"sheet":"Lønark","index":2,"n_rows":71,"n_cols":88,"rows_kept":71,"cut":false,"hidden":true,"merged":[]}
[1,2,3,4,5,6,7,8,9,10,11,12,13,14,15,16,17,18,19,20,21,22,23,24,25,26,27,28,29,30,31,32,33,34,35,36,37,38,39,40,41,42,43,44,45,46,47,48,49,50,51,52,53,54,55,56]
["Næstved",null,null,null,null,null,null,null,null,null,null,null,null,null,null,null,null,null,null,null,null,null,null,"Løn","Årsløn",null,null,"Ureguleret ikke-pensionsgivende tillæg",null,null,null,"Årsløn ialt ",null,null,null,null,null,null,null,null,null,null,null,null,null,null,null,null,null,null,null,null,null,null,null,null,null,null,null,null,null,null,null,null,null,null,null,null,null,null,null,null,null,null,null,null,null,null,null,null,null,null,null,null,null,"Lavtlønsprojekt"]
[null,null,null,null,null,null,null,null,null,null,null,null,null,null,null,null,null,null,null,null,null,null,null,"Løn","Årsløn",null,null,"Ureguleret ikke-pensionsgivende tillæg",null,null,null,null,null,null,null,null,null,"Områdetillæg inkl. regulering",null,null,null,null,"Årsløn ialt ",null,null,null,null,null,"Pensionsgivende løn",null,null,null,null,null,null,null,null,"Pensionsgivende løn",null,null,null,null,null,"Løn","timelønninger",null,null,null,null,null,"Løn","timelønninger + 50%",null,null,null,null,null,"Løn","søndagstillæg - 50%",null,null,null,null,null,null,"2019-03-31",0,0]
[null,"Månedsløn, løngrupper",null,null,"Lønniveau:",{"$f":"VLOOKUP(beregningsdato,regpct_tabel,1,TRUE)","v":"2023-04-01"},null,"Optrapning fra:",null,null,null,null,"Pensionsgivende løn",null,null,null,null,null,"Pensionsgivende løn, optrapning fra:",null,null,null,null,"trin","Grundsats","%-reg.","Sats","Omr 1","Omr 2","Omr 3","Omr 4",null,null,null,null,null,null,1,2,3,4,null,"Omr 0","Omr 1","Omr 2","Omr 3","Omr 4",null,"Grundsats","%-reg.","Sats",null,"Pensionsudbygningspct:",null,null,{"$f":"VLOOKUP(F4,regpct_tabel,3,FALSE)","v":1},null,"Omr 0","Omr 1","Omr 2","Omr 3","Omr 4",null,"trin","Omr 0","Omr 1","Omr 2","Omr 3","Omr 4",null,"trin","Omr 0","Omr 1","Omr 2","Omr 3","Omr 4",null,"trin","Omr 0","Omr 1","Omr 2","Omr 3","Omr 4",null,null,"2019-04-01",382,0]
[null,0,1,2,3,4,null,"0->1","1->2","2->3",null,null,0,1,2,3,4,null,"0->1","1->2","2->3","3->4",null,null,{"$f":"VLOOKUP(beregningsdato,Lavtløn,2,TRUE)","v":1035},{"$f":"valgt_regulering-1","v":0.49830400000000008},"2019-04-01","2022-04-01",{"$f":"VLOOKUP(beregningsdato,Lavtløn,3,TRUE)","v":653},null,null,null,null,null,null,null,null,{"$f":"IF(beregningsdato<40087,0,regulering)","v":0.49830400000000008},{"$f":"IF(beregningsdato<40087,0,5)","v":5},null,null,null,null,null,null,null,null,null,null,null,null,null,null,null,null,null,null,null,null,null,null,null,null,null,null,null,null,null,null,null,null,null,null,null,null,null,null,null,null,null,null,null,null,null,null,"2022-04-01",{"$f":"CI4+CJ5","v":1035},653]
[1,{"$f":"AQ6/12","v":18378.416666666668},18638.333333333332,18818.333333333332,19078.333333333332,19258.333333333332,null,{"$f":"ROUND(AQ6+(AR6-AQ6)/3*faktor,0)/12","v":20200647.666666668},{"$f":"ROUND(AR6+(AS6-AR6)/3*faktor,0)/12","v":13995458.333333334},{"$f":"ROUND(AS6+(AT6-AS6)/3*faktor,0)/12","v":20207558.333333332},null,1,{"$f":"BF6/12","v":18378.416666666668},18638.333333333332,18818.333333333332,19078.333333333332,19258.333333333332,null,{"$f":"(BF6+ROUND((BG6-BF6)/3*faktor,0))/12","v":20200647.666666668},{"$f":"(BG6+ROUND((BH6-BG6)/3*faktor,0))/12","v":13995458.333333334},{"$f":"(BH6+ROUND((BI6-BH6)/3*faktor,0))/12","v":20207558.333333332},{"$f":"(BI6+ROUND((BJ6-BI6)/3*faktor,0))/12","v":13995898.333333334},null,1,147194,{"$f":"ROUND(Y6*regulering,0)","v":73347},{"$f":"Y6+Z6","v":220541},2585,4374,6959,8748,null,2082,3523,5606,7047,null,{"$f":"ROUND(VLOOKUP($X6,$X:$AJ,(4+AL$4)+$AM$5)*(1+$AL$5),0)","v":3119},5279,8399,10559,null,{"$f":"$AA6","v":220541},{"$f":"$AA6+AL6","v":223660},225820,228940,231100,null,147194,{"$f":"AW6*regulering","v":73347.358976000018},{"$f":"ROUND(SUM(AW6:AX6),0)","v":220541},null,{"$f":"ROUND(AL6*udbygningspct,0)","v":3119},{"$f":"ROUND(AM6*udbygningspct,0)","v":5279},{"$f":"ROUND(AN6*udbygningspct,0)","v":8399},{"$f":"ROUND(AO6*udbygningspct,0)","v":10559},null,{"$f":"AY6","v":220541},{"$f":"$BF6+BA6","v":223660},{"$f":"$BF6+BB6","v":225820},228940,231100,null,1,{"$f":"AQ6/1924","v":114.62629937629937},116.24740124740124,117.37006237006237,118.99168399168398,120.11434511434511,null,1,{"$f":"AQ6/1924*1.5","v":171.93944906444906},{"$f":"AR6/1924*1.5","v":174.37110187110187},{"$f":"AS6/1924*1.5","v":176.05509355509355},{"$f":"AT6/1924*1.5","v":178.48752598752597},{"$f":"AU6/1924*1.5","v":180.17151767151768},null,1,{"$f":"AQ6/1924/2","v":57.313149688149686},58.123700623700621,58.685031185031185,59.495841995841992,60.057172557172557]
[2,18660.75,18927.083333333332,19111.333333333332,19377.666666666668,19562,null,20699177.75,14325755.333333334,20699628.333333332,null,2,18660.75,18927.083333333332,19111.333333333332,19377.666666666668,19562,null,20699177.75,14325755.333333334,20699628.333333332,14332676.666666666,null,2,149455,74474,223929,2648,4481,7128,8961,null,2133,3609,5742,7218,null,3196,5407,8603,10815,null,{"$f":"$AA7","v":223929},227125,229336,232532,234744,null,149455,{"$f":"AW7*regulering","v":74474.024320000011},{"$f":"ROUND(SUM(AW7:AX7),0)","v":223929},null,3196,5407,8603,10815,null,{"$f":"AY7","v":223929},227125,229336,232532,234744,null,2,116.38721413721414,118.04833679833679,119.19750519750519,120.85862785862786,122.00831600831602,null,2,{"$f":"AQ7/1924*1.5","v":174.58082120582122},177.07250519750519,178.79625779625781,181.28794178794178,183.01247401247403,null,2,58.193607068607072,59.024168399168396,59.598752598752597,60.429313929313928,61.004158004158008]
[3,18950.666666666668,19223.333333333332,19412.25,19685,19874,null,21191244.666666668,14688413.583333334,21198177,null,3,18950.666666666668,19223.333333333332,19412.25,19685,19874,null,21191244.666666668,14688413.583333334,21198177,14695346,null,3,151777,75631,227408,2711,4590,7301,9180,null,2184,3697,5881,7395,null,3272,5539,8812,11080,null,227408,230680,232947,236220,238488,null,151777,75631.086208000008,227408,null,3272,5539,8812,11080,null,227408,230680,232947,236220,238488,null,3,118.19542619542619,119.8960498960499,121.07432432432432,122.77546777546777,123.95426195426195,null,3,177.29313929313929,179.84407484407484,181.61148648648648,184.16320166320168,185.93139293139293,null,3,59.097713097713097,59.948024948024951,60.537162162162161,61.387733887733887,61.977130977130976]
[4,19248.583333333332,19528.166666666668,19721.583333333332,20001.083333333332,20194.5,null,21728614.833333332,15038138.916666666,21722617.083333332,null,4,19248.583333333332,19528.166666666668,19721.583333333332,20001.083333333332,20194.5,null,21728614.833333332,15038138.916666666,21722617.083333332,15038611.833333334,null,4,154163,76820,230983,2779,4703,7482,9405,null,2239,3788,6027,7576,null,3355,5676,9030,11351,null,230983,234338,236659,240013,242334,null,154163,76820.039552000017,230983,null,3355,5676,9030,11351,null,230983,234338,236659,240013,242334,null,4,120.05353430353431,121.79729729729729,123.00363825363826,124.7468814968815,125.95322245322245,null,4,180.08030145530145,182.69594594594594,184.50545738045739,187.12032224532226,188.92983367983368,null,4,60.026767151767153,60.898648648648646,61.501819126819129,62.37344074844075,62.976611226611226]
[5,19554.583333333332,19840.916666666668,20039.25,20325.583333333332,20523.75,null,22253051.583333332,15420225.916666666,22253536.25,null,5,19554.583333333332,19840.916666666668,20039.25,20325.583333333332,20523.75,null,22253051.583333332,15420225.916666666,22253536.25,15407769.083333334,null,5,156614,78041,234655,2847,4819,7666,9636,null,2293,3882,6175,7762,null,3436,5816,9252,11630,null,234655,238091,240471,243907,246285,null,156614,78041.382656000016,234655,null,3436,5816,9252,11630,null,234655,238091,240471,243907,246285,null,5,121.96205821205821,123.747920997921,124.98492723492724,126.77079002079002,128.00675675675674,null,5,182.94308731808732,185.62188149688149,187.47739085239087,190.15618503118503,192.0101351351351,null,5,60.981029106029105,61.8739604989605,62.492463617463621,63.385395010395008,64.003378378378372]
[6,19869.416666666668,20162.833333333332,20366,20659.25,20862.416666666668,null,22803380.166666668,15795851.333333334,22790935.25,null,6,19869.416666666668,20162.833333333332,20366,20659.25,20862.416666666668,null,22803380.166666668,15795851.333333334,22790935.25,15796347.75,null,6,159135,79298,238433,2917,4937,7854,9873,null,2350,3977,6326,7953,null,3521,5959,9478,11916,null,238433,241954,244392,247911,250349,null,159135,79297.607040000017,238433,null,3521,5959,9478,11916,null,238433,241954,244392,247911,250349,null,6,123.92567567567568,125.75571725571726,127.02286902286902,128.8518711018711,130.11902286902287,null,6,185.88851351351352,188.63357588357587,190.53430353430352,193.27780665280665,195.17853430353432,null,6,61.962837837837839,62.877858627858629,63.511434511434508,64.425935550935549,65.059511434511435]
[7,20192.25,20492.916666666668,20701.166666666668,21001.833333333332,21209.833333333332,null,23366658.25,16190897.166666666,23367167.166666668,null,7,20192.25,20492.916666666668,20701.166666666668,21001.833333333332,21209.833333333332,null,23366658.25,16190897.166666666,23367167.166666668,16171993.833333334,null,7,161721,80586,242307,2989,5060,8049,10118,null,2408,4076,6484,8150,null,3608,6107,9715,12211,null,242307,245915,248414,252022,254518,null,161721,80586.221184000009,242307,null,3608,6107,9715,12211,null,242307,245915,248414,252022,254518,null,7,125.93918918918919,127.81444906444906,129.11330561330561,130.98856548856548,132.28586278586278,null,7,188.9087837837838,191.72167359667361,193.66995841995842,196.48284823284823,198.42879417879416,null,7,62.969594594594597,63.907224532224532,64.556652806652806,65.494282744282742,66.142931392931388]
[8,20536.416666666668,20844.833333333332,21058.416666666668,21366.75,21580.25,null,23968782.166666668,16605377.083333334,23962833.416666668,null,8,20536.416666666668,20844.833333333332,21058.416666666668,21366.75,21580.25,null,23968782.166666668,16605377.083333334,23962833.416666668,16599428.25,null,8,164477,81960,246437,3067,5190,8256,10379,null,2470,4181,6650,8360,null,3701,6264,9964,12526,null,246437,250138,252701,256401,258963,null,164477,81959.547008000009,246437,null,3701,6264,9964,12526,null,246437,250138,252701,256401,258963,null,8,128.08575883575884,130.00935550935552,131.3414760914761,133.264553014553,134.59615384615384,null,8,192.12863825363826,195.01403326403329,197.01221413721413,199.89682952182949,201.89423076923077,null,8,64.042879417879419,65.004677754677758,65.670738045738048,66.632276507276501,67.29807692307692]
[9,21182.416666666668,21498.583333333332,21717.333333333332,22033.333333333332,22252.166666666668,null,{"$f":"ROUND(AQ14+(AR14-AQ14)/3*faktor,0)/12","v":24571207.916666668},{"$f":"ROUND(AR14+(AS14-AR14)/3*faktor,0)/12","v":17007217.333333332},{"$f":"ROUND(AS14+(AT14-AS14)/3*faktor,0)/12","v":24558801.333333332},null,9,21182.416666666668,21498.583333333332,21717.333333333332,22033.333333333332,22252.166666666668,null,{"$f":"(BF14+ROUND((BG14-BF14)/3*faktor,0))/12","v":24571207.916666668},{"$f":"(BG14+ROUND((BH14-BG14)/3*faktor,0))/12","v":17007217.333333332},{"$f":"(BH14+ROUND((BI14-BH14)/3*faktor,0))/12","v":24558801.333333332},{"$f":"(BI14+ROUND((BJ14-BI14)/3*faktor,0))/12","v":17014222.833333332},null,9,169651,84538,254189,3143,5319,8461,10637,null,2532,4284,6815,8568,null,3794,6419,10211,12837,{"$f":"AR14/12","v":21498.583333333332},254189,{"$f":"ROUND($AA14+AL14,0)","v":257983},{"$f":"$AA14+AM14","v":260608},{"$f":"$AA14+AN14","v":264400},{"$f":"$AA14+AO14","v":267026},null,169651,84537.771904000008,254189,null,3794,6419,10211,12837,null,254189,257983,260608,264400,267026,null,9,132.11486486486487,134.08679833679832,135.45114345114345,137.42203742203742,138.78690228690229,null,9,198.17229729729729,201.13019750519749,203.17671517671516,206.13305613305613,208.18035343035342,null,9,66.057432432432435,67.043399168399162,67.725571725571726,68.71101871101871,69.393451143451145]
[10,21332,21656,21880.25,22204.166666666668,22428.5,null,25179608,17434444.25,25173685.5,null,10,21332,21656,21880.25,22204.166666666668,22428.5,null,25179608,17434444.25,25173685.5,17441463.166666668,null,10,170849,85135,255984,3221,5451,8672,10903,null,2595,4391,6985,8782,null,3888,6579,10466,13158,null,255984,{"$f":"$AA15+AL15","v":259872},262563,266450,269142,null,170849,85134.740096000009,255984,null,3888,6579,10466,13158,null,255984,259872,262563,266450,269142,null,10,133.04781704781703,135.06860706860707,136.46725571725571,138.487525987526,139.88669438669439,null,10,199.57172557172555,202.60291060291058,204.70088357588355,207.731288981289,209.83004158004158,null,10,66.523908523908517,67.534303534303533,68.233627858627855,69.243762993762999,69.943347193347194]
{"$rows_left_out":57}
{"sheet":"Forside","index":3,"n_rows":15,"n_cols":11,"rows_kept":15,"cut":false,"hidden":false,"merged":[[14,3,14,7]]}
[]
[]
[]
[]
[]
[]
[]
[]
[]
[]
[null,null,null,null,null,null,null,null,null,"Lønniveau:","2023-04-01"]
[]
[]
[]
[null,null,null,"Hvad betyder det for lønnen, hvis man ændrer på lønsammensætning eller timetal ?"]
{"$rows_left_out":1}
{"sheet":"Omregner","index":4,"n_rows":24,"n_cols":9,"rows_kept":24,"cut":false,"hidden":false,"merged":[]}
[]
[]
[]
[]
[]
[]
[]
[]
[]
[]
[null,null,null,"Valgt lønniveau:",null,{"$f":"Forside!K11","v":"2023-04-01"},null,"Timetal:",37]
[]
[null,"1) Grundbeløb pr. 31-3-2000 omregnet til nutidskr. "]
[null,null,"Årligt grundbeløb:",null,11300]
[]
{"$rows_left_out":10}
{"sheet":"Omregningstabel ","index":5,"n_rows":25,"n_cols":16,"rows_kept":25,"cut":false,"hidden":true,"merged":[]}
[null,null,null,1.362716,1.3824959999999999,1.3980790000000001,1.018559,1.040662,1.0511569999999999,1.061566,1.0834220000000001,1.0886800000000001,1.0926750000000001,1.109523,1.1200380000000001,1.1244540000000001]
[]
[]
[]
[]
[]
[null,"Indtast beløb:",1000]
[]
[]
[null,null,"1/10 '84"]
[null,null,{"$f":"Beløb","v":1000},"1/4 '98"]
[null,"1/4-98",{"$f":"Beløb*_1_4_1998","v":1362.7160000000001},{"$f":"Beløb","v":1000},"1/10 '98"]
[null,"1/10-98",{"$f":"Beløb*_1_10_1998","v":1382.4959999999999},{"$f":"Beløb/_1_4_1998*_1_10_1998","v":1014.515130078461},{"$f":"Beløb","v":1000},"1/4 '99"]
[null,"1/4-99",{"$f":"Beløb*_1_4_1999","v":1398.0790000000002},{"$f":"Beløb/_1_4_1998*_1_4_1999","v":1025.9503814441161},{"$f":"Beløb/_1_10_1998*_1_4_1999","v":1011.2716420156008},{"$f":"Beløb","v":1000}]
[null,"Grundbeløb pr. 31/3-00",{"$f":"ROUND(C14,-2)","v":1400},{"$f":"ROUND(D14,-2)","v":1000},{"$f":"ROUND(E14,-2)","v":1000},{"$f":"ROUND(F14,-2)","v":1000},"1/4 '00"]
{"$rows_left_out":11}
{"sheet":"Tillæg_trin","index":6,"n_rows":16,"n_cols":4,"rows_kept":16,"cut":false,"hidden":true,"merged":[[1,1,1,7]]}
[3]
[]
[null,"Valgt lønniveau: ",{"$f":"Forside!K11","v":"2023-04-01"}]
[]
[null,"Løngruppe",null,3]
[null,"Timer/uge",null,37]
[null,"Pensions-% inkl. evt. fritvalgs-%",null,13.89]
[null,"Særlig feriegodtgørelse, aktuel pct.",null,1.95]
[]
[null,"Stigning:","Fra","Til"]
[null,"Løntrin ",18,19]
[]
[null,"Løn",{"$f":"(VLOOKUP(til_trin,Lønark!A5:F61,løngruppe+2,FALSE)-VLOOKUP(fra_trin,Lønark!A5:F61,løngruppe+2,FALSE))/37*timetal*12","v":4263}]
[null,"Pension inkl. evt. fritvalgstillæg",{"$f":"(VLOOKUP(til_trin,Lønark!L5:Q61,løngruppe+2,FALSE)-VLOOKUP(fra_trin,Lønark!L5:Q61,løngruppe+2,FALSE))/37*timetal*pensionsstatus%*12","v":592.13070000000005}]
[null,"Ferietillæg",{"$f":"ferie_pct%*C13","v":83.128500000000003}]
{"$rows_left_out":2}
{"sheet":"Tillæg_kr","index":7,"n_rows":15,"n_cols":4,"rows_kept":15,"cut":false,"hidden":true,"merged":[[9,1,9,2]]}
[2]
[]
[null,null,"Valgt lønniveau:",{"$f":"Forside!K11","v":"2023-04-01"}]
[]
[{"$f":"VLOOKUP(dummy,reg_procenter,2,FALSE)","v":{"$error":"#NAME?"}},null,"Årligt beløb, 31.3.2000 niveau ",12900]
[null,null,"Timer/uge",30]
[null,null,"Pension-% inkl. evt. fritvalgs-%",13.89]
[null,null,"Særlig feriegodtg., aktuel pct.",1.95]
[]
[]
[null,null,"bruttoudgift / år","bruttoudgift / md"]
[null,"Løn",{"$f":"kr*valgt_regulering/37*timetal","v":15671.449945945948},{"$f":"beløb/12","v":1305.9541621621622}]
[null,"Pension inkl. evt. fritvalgstillæg",{"$f":"beløb*pensionsstatus%","v":2176.7643974918919},{"$f":"C13/12","v":181.39703312432434}]
[null,"Ferietillæg",{"$f":"D8%*(C12)","v":305.59327394594595},{"$f":"C14/12","v":25.466106162162163}]
[null,"Bruttoudgift i alt",{"$f":"ROUND(SUM(C12:C14),0)","v":18154},{"$f":"ROUND(SUM(D12:D14),0)","v":1513}]
{"$rows_left_out":1}
{"sheet":"Samlet_omk","index":8,"n_rows":26,"n_cols":3,"rows_kept":26,"cut":false,"hidden":false,"merged":[]}
[2,"Valgt lønniveau: ",{"$f":"Forside!K11","v":"2023-04-01"}]
[]
[null,"Løngruppe",0]
[null,"Timer/uge",37]
[null,"Pensions-% inkl. evt. fritvalgs-%",13.89]
[null,"Særlig feriegodtgørelse, aktuel pct.",1.95]
[]
[null,"Løntrin ",21]
[]
[null,"Reguleret tillæg (31.3.2000) kr./år",12000]
[]
[]
[null,"Løn/time",{"$f":"IFERROR(ROUND(VLOOKUP(fra_trin,Lønark!A5:AU61,løngruppe+43,FALSE)/1924,2)+ROUND(C10*valgt_regulering/1924,2),ROUND(C10*valgt_regulering/1924,2))","v":168.16}]
[null,"Pension inkl. evt. fritvalgstillæg",{"$f":"C13*pensionsstatus%","v":23.357423999999998}]
[null,"Ferietillæg",{"$f":"C6%*C13","v":3.2791199999999998}]
{"$rows_left_out":12}
{"sheet":"Tid op_ned","index":9,"n_rows":31,"n_cols":8,"rows_kept":31,"cut":false,"hidden":false,"merged":[]}
[2,"Valgt lønniveau: ",{"$f":"Forside!K11","v":"2023-04-01"}]
[]
[null,"Grundoplysninger:"]
[null,"Løngruppe",4]
[null,"Pensions-% inkl. evt. fritvalgs-%",12.6]
[null,"Særlig feriegodtgørelse, aktuel procent",1.95]
[]
[]
[null,"Lønsammensætning (trin i alt og grundbeløb i alt)","Før ændring",null,"Efter ændring"]
[]
[null,"Løndele:","I alt"]
[]
[null,"Løntrin - centralt og lokalt aftalte",21,null,21]
[]
[null,"Tillæg (grundbeløb 31.3.2000) kr./år centralt og lokalt aftalte"]
{"$rows_left_out":16}